Table S1  The basic clinical information of healthy controls (n=6) and COVID-19 patients (n=18) enrolled in this study,Unnamed: 1,Unnamed: 2,Unnamed: 3,Unnamed: 4,Unnamed: 5,Unnamed: 6,Unnamed: 7,Unnamed: 8,Unnamed: 9,Unnamed: 10,Unnamed: 11,Unnamed: 12,Unnamed: 13,Unnamed: 14,Unnamed: 15,Unnamed: 16,Unnamed: 17,Unnamed: 18,Unnamed: 19,Unnamed: 20,Unnamed: 21,Unnamed: 22,Unnamed: 23,Unnamed: 24
Sample NO.,S1,S2,S3,S4,S5,S6,S7,S8,M1,M2,M3,M4,M5,A1,A2,A3,A4,A5,H1,H2,H3,H4,H5,H6
Severity,severe,severe,severe,severe,severe,severe,severe,severe,mild,mild,mild,mild,mild,asymptomatic,asymptomatic,asymptomatic,asymptomatic,asymptomatic,HC,HC,HC,HC,HC,HC
Age,73,46,67,65,62,57,63,66,35,36,42,49,32,49,59,40,31,22,66,36,31,31,24,32
Gender,Male,Male,Male,Female,Male,Female,Male,Male,Male,Male,Male,Female,Female,Female,Male,Male,Male,Male,Female,Female,Male,Male,Female,Female
sojourn history,Wuhan,Wuhan,Wuhan,Wuhan,Wuhan,Wuhan,Wuhan,Wuhan,Wuhan,Wuhan,Wuhan,Wuhan,Wuhan,South Africa,Russia,Russia,Mexico,Mexico,,,,,,
Symptom onset day,2020-01-20 00:00:00,2020-01-21 00:00:00,2020-01-17 00:00:00,2020-01-04 00:00:00,2020-01-11 00:00:00,2020-01-21 00:00:00,2020-01-08 00:00:00,2020-01-03 00:00:00,2020-01-09 00:00:00,2020-01-09 00:00:00,2020-01-18 00:00:00,2020-01-22 00:00:00,2020-01-21 00:00:00,,,,,,,,,,,
First symptom,Fever,Fever/Cough,Fever/diarrhea,Fever/Cough,Fever/Cough,Cough,Fever/Cough,Fever,Cough,Cough,Fever/Cough,Fever/Cough,Fever,asymptomatic,asymptomatic,asymptomatic,asymptomatic,asymptomatic,,,,,,
Hospitalization date,2020-01-22 00:00:00,2020-01-22 00:00:00,2020-01-22 00:00:00,2020-01-20 00:00:00,2020-01-15 00:00:00,2020-01-23 00:00:00,2020-01-15 00:00:00,2020-01-11 00:00:00,2020-01-15 00:00:00,2020-01-16 00:00:00,2020-01-21 00:00:00,2020-01-23 00:00:00,2020-01-23 00:00:00,2020-09-05 00:00:00,2020-09-05 00:00:00,2020-09-05 00:00:00,2020-09-02 00:00:00,2020-09-02 00:00:00,,,,,,
Chronic basic disease,None,None,Bronchitis,Diabetes,None,None,COPD,Hyperpression,None,None,None,None,None,Hyperpression,Hyperpression,None,None,None,,,,,,
CT finding,Bilateral pneumonia,Unilateral pneumonia,Bilateral pneumonia,Unilateral pneumonia,Bilateral pneumonia,Bilateral pneumonia,Bilateral pneumonia,Bilaeral pneumonia,Bilateral pneumonia,Bilateral pneumonia,Bilaeral pneumonia,Bilaeral pneumonia,Unilateral pneumonia,Bilaeral pneumonia,Bilaeral pneumonia,Bilaeral pneumonia,Bilaeral pneumonia,Bilaeral pneumonia,,,,,,
Outcome-Time,Cure/2020/2/20,Cure/2020/3/8,Cure/2020/3/20,Cure/2020/3/9,Cure/2020/2/27,Cure/2020/3/7,Dead/2020/2/16,Dead/2020/2/16,Cure/2020/2/3,Cure/2020/1/27,Cure/2020/2/3,Cure/2020/2/8,Cure/2020/2/9,Cure/2020/9/11,Cure/2020/9/11,Cure/2020/10/2,Cure/2020/9/15,Cure/2020/9/30,,,,,,
 1#sampling date,2020-01-23 00:00:00,2020-01-23 00:00:00,2020-01-24 00:00:00,2020-01-20 00:00:00,2020-01-16 00:00:00,2020-01-26 00:00:00,2020-01-15 00:00:00,2020-01-11 00:00:00,2020-01-19 00:00:00,1.12020/1/17,2020-01-23 00:00:00,2020-01-28 00:00:00,2020-01-28 00:00:00,2020-09-05 00:00:00,2020-09-05 00:00:00,2020-09-05 00:00:00,2020-09-05 00:00:00,2020-09-05 00:00:00,,,,,,
WOS,3,3,5,4,4,5,5,4,3,3,3,3,3,2,2,2,2,2,,,,,,
 2#sampling date,2020-02-02 00:00:00,2020-02-02 00:00:00,2020-01-28 00:00:00,2020-01-28 00:00:00,2020-01-30 00:00:00,2020-01-29 00:00:00,2020-01-29 00:00:00,2020-01-31 00:00:00,2020-01-29 00:00:00,2020-01-22 00:00:00,2020-02-03 00:00:00,2020-02-06 00:00:00,2020-02-09 00:00:00,2020-09-12 00:00:00,2020-09-12 00:00:00,2020-09-14 00:00:00,2020-09-17 00:00:00,2020-09-14 00:00:00,,,,,,
WOS,6,6,6,6,5,6,7,7,4,3,4,3,3,,,,,,,,,,,
 3#sampling date,,2020-04-07 00:00:00,,2020-04-06 00:00:00,2020-03-29 00:00:00,,,,2020-03-03 00:00:00,,2020-03-03 00:00:00,2020-02-02 00:00:00,2020-03-09 00:00:00,0,0,2,0,2,,,,,,
WOS,,0,,0,0,,,,0,,0,0,0,,,,,,,,,,,
